阿哥论坛

 找回密码
 立即注册

QQ登录

只需一步,快速开始

新浪微博账号登陆

只需一步,快速开始

搜索
查看: 122|回复: 0

centos7.2 thrift安装实录

[复制链接]

2019

主题

1

好友

1万

积分

管理员

Rank: 9Rank: 9Rank: 9

优秀会员 助人为乐 辛勤工作 技术精英 多才多艺 优秀班竹 灌水天才 星球管理 宣传大使 灌水之王 财富勋章 版主勋章 动漫勋章 勤奋会员 论坛精英 PS高手 心 8 闪游皮肤 双鱼座 8★8➹ 志愿者 乖

发表于 2019-1-15 13:59:18 |显示全部楼层
centos7.2 thrift安装实录
本文出自阿哥论坛:http://it.agoit.com/thread-468535-1-1.html

安装步骤:
1.安装CentOS需要的扩展
yum install -y automake libtool Flex bison pkgconfig gcc-C++ libevent-devel zlib-devel Python-devel Ruby-devel openssl-devel

2.安装boost,本地源码安装最安全
        wget http://sourceforge.net/projects/ ... boost_1_53_0.tar.gz
        tar -xvf boost_1_53_0.tar.gz
        cd boost_1_53_0
        ./bootstrap.sh
        ./b2 install

在安装boost的时候,使用的yum install boost-devel,在最终安装thrift包的时候,会报找不到libboost_unit_test_framework.a文件,并不是google中表述的把/usr/lib64/libboost_unit_test_framework.a 软连接下就好,而是安装后的boost连/usr/lib64/目录下都不存在这个文件libboost_unit_test_framework.a文件;
3.源码安装thrift
wget http://apache.fayea.com/thrift/0.10.0/thrift-0.10.0.tar.gz tar -xvf thrift-0.10.0.tar.gz
cd thrift-0.10.0
./configure --with-lua=no --with-prefix=/usr/local/thrift
make && make install





安装报错及解决办法:
报错一:
libtool: link: g++ -std=c++11 -Wall -Wextra -pedantic -g -O2 -o .libs/processor_test processor/ProcessorTest.o processor/EventLog.o processor/ServerThread.o  -L/usr/lib64 ./.libs/libprocessortest.a ../../../lib/cpp/.libs/libthrift.so ../../../lib/cpp/.libs/libthriftnb.so /usr/lib64/libboost_unit_test_framework.a -levent -lrt -lpthread -Wl,-rpath -Wl,/usr/local/thrift/lib
g++: error: /usr/lib64/libboost_unit_test_framework.a: No such file or directory
make[5]: *** [processor_test] 错误 1
make[5]: 离开目录“/opt/soft/thrift-0.12.0/lib/cpp/test”
make[4]: *** [all] 错误 2
make[4]: 离开目录“/opt/soft/thrift-0.12.0/lib/cpp/test”
make[3]: *** [all-recursive] 错误 1
make[3]: 离开目录“/opt/soft/thrift-0.12.0/lib/cpp”
make[2]: *** [all-recursive] 错误 1
make[2]: 离开目录“/opt/soft/thrift-0.12.0/lib”
make[1]: *** [all-recursive] 错误 1
make[1]: 离开目录“/opt/soft/thrift-0.12.0”
make: *** [all] 错误 2


解决方案1:
修改方法:先查找文件 find / -name libboost_unit_test_framework.a,比如在 /usr/local/lib/libboost_unit_test_framework.a,就可以做如下操作,sudo ln -s /usr/local/lib/libboost_unit_test_framework.a /usr/lib64/libboost_unit_test_framework.a,然后重新执行 make


解决方案2:
源码本地编译boost安装;
wget http://sourceforge.net/projects/ ... boost_1_53_0.tar.gz
tar -xvf boost_1_53_0.tar.gz
cd boost_1_53_0
./bootstrap.sh
./b2 install


报错二:
gcc宏编译问题__STDC_FORMAT_MACROS
不要用git包,昂~,因为使用git包在安装的时候会报
src/thrift/server/TNonblockingServer.cpp:460:16: 错误:expected ‘)’ before ‘PRIu32’"(%" PRIu32 " > %" PRIu64

报错三:
[Composer\Exception\NoSslException]
  The openssl extension is required for SSL/TLS protection but is not available. If you can not enable the openssl extension, you can disable this error, at you
  r own risk, by setting the 'disable-tls' option to true.



首先需要安装composer
curl -sS https://getcomposer.org/installer | PHP
mv composer.phar /usr/local/bin/composer
chmod -R 777 /usr/local/bin/composer
composer -V

查看一下您的PHP是在哪个位置,以及php.ini的位置


能看到的这边的php是在  /usr/local/php/bin/目录下的,那么php.ini也必须位于些目录下。
同时再看php.ini是否开启extension=openssl.so                ^
该会员没有填写今日想说内容.
您需要登录后才可以回帖 登录 | 立即注册 新浪微博账号登陆

回顶部